Reaction Details
TargetHistone deacetylase 3/Nuclear receptor corepressor 2 (HDAC3/NCoR2)
LigandBDBM50105327
Substrate/Competitorn/a
Meas. Tech.ChEMBL_1618817 (CHEMBL3860986)
IC50 4.9±n/a nM
Citation Rabal, OSánchez-Arias, JACuadrado-Tejedor, Mde Miguel, IPérez-González, MGarcía-Barroso, CUgarte, AEstella-Hermoso de Mendoza, ASáez, EEspelosin, MUrsua, SHaizhong, TWei, WMusheng, XGarcia-Osta, AOyarzabal, J Design, Synthesis, and Biological Evaluation of First-in-Class Dual Acting Histone Deacetylases (HDACs) and Phosphodiesterase 5 (PDE5) Inhibitors for the Treatment of Alzheimer's Disease. J Med Chem59:8967-9004 (2016) 
 
Histone deacetylase 3/Nuclear receptor corepressor 2 (HDAC3/NCoR2)
Name:Histone deacetylase 3/Nuclear receptor corepressor 2 (HDAC3/NCoR2)
Type:n/a
Mol. Mass.:n/a
Description:ASSAY_ID of ChEMBL is 2146499
Components:This complex has 2 components.
Component 1
Name:Histone deacetylase 3
Synonyms:HD3 HDAC3_HUMAN Human HDAC3 SMAP45
Type:Enzyme
Mol. Mass.:48829.55
Organism:Homo sapiens (Human)
Description:O15379
Residue:428
Component 2
Name:Nuclear receptor corepressor 2
Synonyms:CTG repeat protein 26 Histone deacetylase 2/Nuclear receptor corepressor 2 NCOR2 Nuclear receptor corepressor 2 SMAP270 Silencing mediator of retinoic acid and thyroid hormone receptor TRAC | Thyroid-, retinoic-acid-receptor-associated corepressor
Type:Enzyme
Mol. Mass.:274839.59
Organism:Homo sapiens (Human)
Description:Q9Y618
Residue:2514
BDBM50105327
NameBDBM50105327
Synonyms:JNJ-26481585 | Quisinostat
TypeSmall organic molecule
Emp. Form.C21H26N6O2
Mol. Mass.394.4701
SMILESCn1cc(CNCC2CCN(CC2)c2ncc(cn2)C(=O)NO)c2ccccc12