Reaction Details
TargetCone cGMP-specific 3',5'-cyclic phosphodiesterase subunit alpha'
LigandBDBM50196772
Substrate/Competitorn/a
Meas. Tech.ChEMBL_1618858 (CHEMBL3861027)
IC50 0.130000±n/a nM
Citation Rabal, OSánchez-Arias, JACuadrado-Tejedor, Mde Miguel, IPérez-González, MGarcía-Barroso, CUgarte, AEstella-Hermoso de Mendoza, ASáez, EEspelosin, MUrsua, SHaizhong, TWei, WMusheng, XGarcia-Osta, AOyarzabal, J Design, Synthesis, and Biological Evaluation of First-in-Class Dual Acting Histone Deacetylases (HDACs) and Phosphodiesterase 5 (PDE5) Inhibitors for the Treatment of Alzheimer's Disease. J Med Chem59:8967-9004 (2016) 
 
Cone cGMP-specific 3',5'-cyclic phosphodiesterase subunit alpha'
Name:Cone cGMP-specific 3',5'-cyclic phosphodiesterase subunit alpha'
Type:Protein
Mol. Mass.:99132.02
Organism:Homo sapiens (Human)
Description:P51160
Residue:858
BDBM50196772
NameBDBM50196772
Synonyms:CHEMBL3936651
TypeSmall organic molecule
Emp. Form.C26H30N8O5
Mol. Mass.534.567
SMILESCCOc1ccc(OC2CCN(CC2)c2ncc(cn2)C(=O)NO)cc1-c1nc2c(CC)nn(C)c2c(=O)[nH]1