Reaction Details
TargetSodium/hydrogen exchanger 3
LigandBDBM50196811
Substrate/Competitorn/a
Meas. Tech.ChEMBL_1618862 (CHEMBL3861031)
IC50 2.0±n/a nM
Citation Rackelmann, NMatter, HEnglert, HFollmann, MMaier, TWeston, JArndt, PHeyse, WMertsch, KWirth, KBialy, L Discovery and Optimization of 1-Phenoxy-2-aminoindanes as Potent, Selective, and Orally Bioavailable Inhibitors of the Na J Med Chem59:8812-8829 (2016) 
 
Sodium/hydrogen exchanger 3
Name:Sodium/hydrogen exchanger 3
Type:PROTEIN
Mol. Mass.:92861.96
Organism:Homo sapiens (Human)
Description:ChEMBL_141050
Residue:834
BDBM50196811
NameBDBM50196811
Synonyms:CHEMBL3967635
TypeSmall organic molecule
Emp. Form.C21H23Cl3N2O3S
Mol. Mass.489.843
SMILESCS(=O)(=O)c1ccc(O[C@@H]2[C@H](Cc3c2cc(Cl)cc3Cl)N2CCCNCC2)c(Cl)c1