Reaction Details
TargetSodium/hydrogen exchanger isoform 3
LigandBDBM50196789
Substrate/Competitorn/a
Meas. Tech.ChEMBL_1618874 (CHEMBL3861043)
IC50 7.8±n/a nM
Citation Rackelmann, NMatter, HEnglert, HFollmann, MMaier, TWeston, JArndt, PHeyse, WMertsch, KWirth, KBialy, L Discovery and Optimization of 1-Phenoxy-2-aminoindanes as Potent, Selective, and Orally Bioavailable Inhibitors of the Na J Med Chem59:8812-8829 (2016) 
 
Sodium/hydrogen exchanger isoform 3
Name:Sodium/hydrogen exchanger isoform 3
Type:PROTEIN
Mol. Mass.:15783.83
Organism:Sus scrofa
Description:ChEMBL_116993
Residue:140
BDBM50196789
NameBDBM50196789
Synonyms:CHEMBL3892788
TypeSmall organic molecule
Emp. Form.C23H24Cl3FN4O2
Mol. Mass.513.82
SMILESCl.Cc1nnc(C)n1-c1ccc(O[C@@H]2[C@H](Cc3c2cc(Cl)cc3Cl)N2CC[C@@H](O)C2)c(F)c1