Reaction Details
TargetPotassium channel subfamily K member 18
LigandBDBM50197061
Substrate/Competitorn/a
Meas. Tech.ChEMBL_1619068 (CHEMBL3861237)
EC50 18800±n/a nM
Citation Monteillier, ALoucif, AOmoto, KStevens, EBLainez, SSaintot, PPCao, LPryde, DC Investigation of the structure activity relationship of flufenamic acid derivatives at the human TRESK channel K Bioorg Med Chem Lett26:4919-4924 (2016) 
 
Potassium channel subfamily K member 18
Name:Potassium channel subfamily K member 18
Type:PROTEIN
Mol. Mass.:43672.81
Organism:Homo sapiens (Human)
Description:ChEMBL_105638
Residue:384
BDBM50197061
NameBDBM50197061
Synonyms:CHEMBL3965023
TypeSmall organic molecule
Emp. Form.C17H19N5
Mol. Mass.293.3663
SMILESCC(C)(C)c1cccc(Nc2ccccc2-c2nnn[nH]2)c1