Reaction Details
TargetPhosphatidylinositol 4-phosphate 3-kinase C2 domain-containing subunit alpha
LigandBDBM50121212
Substrate/Competitorn/a
Meas. Tech.ChEMBL_1619079 (CHEMBL3861248)
IC50>10000±n/a nM
Citation Falasca, MHamilton, JRSelvadurai, MSundaram, KAdamska, AThompson, PE Class II Phosphoinositide 3-Kinases as Novel Drug Targets. J Med Chem60:47-65 (2017) 
 
Phosphatidylinositol 4-phosphate 3-kinase C2 domain-containing subunit alpha
Name:Phosphatidylinositol 4-phosphate 3-kinase C2 domain-containing subunit alpha
Type:Protein
Mol. Mass.:190704.50
Organism:Homo sapiens (Human)
Description:O00443
Residue:1686
BDBM50121212
NameBDBM50121212
Synonyms:CHEMBL3622372
TypeSmall organic molecule
Emp. Form.C19H21ClF3N5O2
Mol. Mass.443.851
SMILESC[C@@H]1COCCN1c1cc(=O)n2CC[C@H](N(Cc3cncc(Cl)c3)c2n1)C(F)(F)F