Reaction Details
TargetDNA-dependent protein kinase catalytic subunit
LigandBDBM81368
Substrate/Competitorn/a
Meas. Tech.ChEMBL_1619097 (CHEMBL3861266)
IC50 13±n/a nM
Citation Falasca, MHamilton, JRSelvadurai, MSundaram, KAdamska, AThompson, PE Class II Phosphoinositide 3-Kinases as Novel Drug Targets. J Med Chem60:47-65 (2017) 
 
DNA-dependent protein kinase catalytic subunit
Name:DNA-dependent protein kinase catalytic subunit
Type:Protein
Mol. Mass.:469114.78
Organism:Homo sapiens (Human)
Description:P78527
Residue:4128
BDBM81368
NameBDBM81368
Synonyms:PIK90
TypeSmall organic molecule
Emp. Form.C18H17N5O3
Mol. Mass.351.3593
SMILESCOc1ccc2C3=NCCN3C(NC(=O)c3cccnc3)=Nc2c1OC