Reaction Details
TargetPhosphatidylinositol 4-phosphate 3-kinase C2 domain-containing subunit beta
LigandBDBM81368
Substrate/Competitorn/a
Meas. Tech.ChEMBL_1619092 (CHEMBL3861261)
IC50 64±n/a nM
Citation Falasca, MHamilton, JRSelvadurai, MSundaram, KAdamska, AThompson, PE Class II Phosphoinositide 3-Kinases as Novel Drug Targets. J Med Chem60:47-65 (2017) 
 
Phosphatidylinositol 4-phosphate 3-kinase C2 domain-containing subunit beta
Name:Phosphatidylinositol 4-phosphate 3-kinase C2 domain-containing subunit beta
Type:Enzyme
Mol. Mass.:184784.86
Organism:Homo sapiens (Human)
Description:O00750
Residue:1634
BDBM81368
NameBDBM81368
Synonyms:PIK90
TypeSmall organic molecule
Emp. Form.C18H17N5O3
Mol. Mass.351.3593
SMILESCOc1ccc2C3=NCCN3C(NC(=O)c3cccnc3)=Nc2c1OC