Reaction Details
TargetPhosphatidylinositol 4-phosphate 3-kinase C2 domain-containing subunit alpha
LigandBDBM50042924
Substrate/Competitorn/a
Meas. Tech.ChEMBL_1619091 (CHEMBL3861260)
IC50 16000±n/a nM
Citation Falasca, MHamilton, JRSelvadurai, MSundaram, KAdamska, AThompson, PE Class II Phosphoinositide 3-Kinases as Novel Drug Targets. J Med Chem60:47-65 (2017) 
 
Phosphatidylinositol 4-phosphate 3-kinase C2 domain-containing subunit alpha
Name:Phosphatidylinositol 4-phosphate 3-kinase C2 domain-containing subunit alpha
Type:Protein
Mol. Mass.:190704.50
Organism:Homo sapiens (Human)
Description:O00443
Residue:1686
BDBM50042924
NameBDBM50042924
Synonyms:CHEMBL1229535
TypeSmall organic molecule
Emp. Form.C14H16ClN3O4S2
Mol. Mass.389.878
SMILESCC(=O)\N=c1\[nH]c(C)c(s1)-c1ccc(Cl)c(c1)S(=O)(=O)NCCO