Reaction Details
TargetHistone deacetylase 1
LigandBDBM50005711
Substrate/Competitorn/a
Meas. Tech.ChEMBL_1619167 (CHEMBL3861336)
IC50 16±n/a nM
Citation Zwick, VSimões-Pires, CANurisso, APetit, CDos Santos Passos, CRandazzo, GMMartinet, NBertrand, PCuendet, M Synthesis of a selective HDAC6 inhibitor active in neuroblasts. Bioorg Med Chem Lett26:4955-4959 (2016) 
 
Histone deacetylase 1
Name:Histone deacetylase 1
Type:Enzyme
Mol. Mass.:55090.27
Organism:Homo sapiens (Human)
Description:Q13547
Residue:482
BDBM50005711
NameBDBM50005711
Synonyms:CHEBI:46024 TRICHOSTATIN Trichostatin A (TSA) US10722597, Compound Trichostatin US20230322747, Compound trichostatin A | US9265734, TSA
TypeSmall organic molecule
Emp. Form.C17H22N2O3
Mol. Mass.302.3682
SMILESC[C@H](\C=C(/C)\C=C\C(=O)NO)C(=O)c1ccc(cc1)N(C)C