Reaction Details
TargetLeukotriene A-4 hydrolase
LigandBDBM50197085
Substrate/Competitorn/a
Meas. Tech.ChEMBL_1619177 (CHEMBL3861346)
Ki 160±n/a nM
Citation Wittmann, SKKalinowsky, LKramer, JSBloecher, RKnapp, SSteinhilber, DPogoryelov, DProschak, EHeering, J Thermodynamic properties of leukotriene A Bioorg Med Chem24:5243-5248 (2016) 
 
Leukotriene A-4 hydrolase
Name:Leukotriene A-4 hydrolase
Type:Hydrolase; metalloprotease
Mol. Mass.:69280.41
Organism:Homo sapiens (Human)
Description:Human recombinant LTA4H.
Residue:611
BDBM50197085
NameBDBM50197085
Synonyms:CHEMBL3921982
TypeSmall organic molecule
Emp. Form.C16H19NO2
Mol. Mass.257.3276
SMILESCN(C)CCOc1ccc(Oc2ccccc2)cc1