Reaction Details
TargetFatty acid-binding protein, adipocyte
LigandBDBM50197087
Substrate/Competitorn/a
Meas. Tech.ChEMBL_1619186 (CHEMBL3861355)
Ki 13±n/a nM
Citation Kühne, HObst-Sander, UKuhn, BConte, ACeccarelli, SMNeidhart, WRudolph, MGOttaviani, GGasser, RSo, SSLi, SZhang, XGao, LMyers, M Design and synthesis of selective, dual fatty acid binding protein 4 and 5 inhibitors. Bioorg Med Chem Lett26:5092-5097 (2016) 
 
Fatty acid-binding protein, adipocyte
Name:Fatty acid-binding protein, adipocyte
Type:Enzyme
Mol. Mass.:14719.23
Organism:Homo sapiens (Human)
Description:P15090
Residue:132
BDBM50197087
NameBDBM50197087
Synonyms:CHEMBL3950316
TypeSmall organic molecule
Emp. Form.C22H21ClN2O2
Mol. Mass.380.867
SMILESCc1cc(Cl)cc2c(-c3ccccc3)c(C(O)=O)c(nc12)N1CCCCC1