Reaction Details
TargetFatty acid-binding protein 5
LigandBDBM50197089
Substrate/Competitorn/a
Meas. Tech.ChEMBL_1619187 (CHEMBL3861356)
Ki 167±n/a nM
Citation Kühne, HObst-Sander, UKuhn, BConte, ACeccarelli, SMNeidhart, WRudolph, MGOttaviani, GGasser, RSo, SSLi, SZhang, XGao, LMyers, M Design and synthesis of selective, dual fatty acid binding protein 4 and 5 inhibitors. Bioorg Med Chem Lett26:5092-5097 (2016) 
 
Fatty acid-binding protein 5
Name:Fatty acid-binding protein 5
Type:Enzyme
Mol. Mass.:15164.79
Organism:Homo sapiens (Human)
Description:Q01469
Residue:135
BDBM50197089
NameBDBM50197089
Synonyms:CHEMBL3889982
TypeSmall organic molecule
Emp. Form.C22H19ClN4O2
Mol. Mass.406.865
SMILESClc1ccc2nc(N3CCCCC3)c(-c3n[nH]c(=O)o3)c(-c3ccccc3)c2c1