Reaction Details
TargetFatty acid-binding protein 5
LigandBDBM50197092
Substrate/Competitorn/a
Meas. Tech.ChEMBL_1619187 (CHEMBL3861356)
Ki 1200±n/a nM
Citation Kühne, HObst-Sander, UKuhn, BConte, ACeccarelli, SMNeidhart, WRudolph, MGOttaviani, GGasser, RSo, SSLi, SZhang, XGao, LMyers, M Design and synthesis of selective, dual fatty acid binding protein 4 and 5 inhibitors. Bioorg Med Chem Lett26:5092-5097 (2016) 
 
Fatty acid-binding protein 5
Name:Fatty acid-binding protein 5
Type:Enzyme
Mol. Mass.:15164.79
Organism:Homo sapiens (Human)
Description:Q01469
Residue:135
BDBM50197092
NameBDBM50197092
Synonyms:CHEMBL3947458
TypeSmall organic molecule
Emp. Form.C19H16ClNO2
Mol. Mass.325.789
SMILESCC(C)c1nc2ccc(Cl)cc2c(-c2ccccc2)c1C(O)=O