Reaction Details
TargetFatty acid-binding protein, adipocyte
LigandBDBM50197093
Substrate/Competitorn/a
Meas. Tech.ChEMBL_1619186 (CHEMBL3861355)
Ki 11±n/a nM
Citation Kühne, HObst-Sander, UKuhn, BConte, ACeccarelli, SMNeidhart, WRudolph, MGOttaviani, GGasser, RSo, SSLi, SZhang, XGao, LMyers, M Design and synthesis of selective, dual fatty acid binding protein 4 and 5 inhibitors. Bioorg Med Chem Lett26:5092-5097 (2016) 
 
Fatty acid-binding protein, adipocyte
Name:Fatty acid-binding protein, adipocyte
Type:Enzyme
Mol. Mass.:14719.23
Organism:Homo sapiens (Human)
Description:P15090
Residue:132
BDBM50197093
NameBDBM50197093
Synonyms:CHEMBL3959018
TypeSmall organic molecule
Emp. Form.C21H19ClN6
Mol. Mass.390.869
SMILESClc1ccc2nc(N3CCCCC3)c(-c3nnn[nH]3)c(-c3ccccc3)c2c1