Reaction Details
TargetProteinase-activated receptor 1
LigandBDBM50197581
Substrate/Competitorn/a
Meas. Tech.ChEMBL_1619557 (CHEMBL3861726)
IC50 3.1±n/a nM
Citation Abdel-Magid, AF Protease-Activated Receptor 1 (PAR-1) Antagonists as Potential Treatment for Acute Coronary Syndrome. ACS Med Chem Lett7:881-883 (2016) 
 
Proteinase-activated receptor 1
Name:Proteinase-activated receptor 1
Type:Protein
Mol. Mass.:47450.07
Organism:Homo sapiens (Human)
Description:P25116
Residue:425
BDBM50197581
NameBDBM50197581
Synonyms:CHEMBL3929336 | US10322140, Example 4
TypeSmall organic molecule
Emp. Form.C26H23F2N5O3
Mol. Mass.491.4893
SMILES[H][C@@]12[C@@H](C)OC(=O)[C@@]1(CC(F)(F)[C@@H](C)[C@@H]2\C=C\c1ccc(cn1)-c1ccccc1C#N)c1nnc(N)o1