Reaction Details
TargetProteinase-activated receptor 1
LigandBDBM50197614
Substrate/Competitorn/a
Meas. Tech.ChEMBL_1619557 (CHEMBL3861726)
IC50 0.990000±n/a nM
Citation Abdel-Magid, AF Protease-Activated Receptor 1 (PAR-1) Antagonists as Potential Treatment for Acute Coronary Syndrome. ACS Med Chem Lett7:881-883 (2016) 
 
Proteinase-activated receptor 1
Name:Proteinase-activated receptor 1
Type:Protein
Mol. Mass.:47450.07
Organism:Homo sapiens (Human)
Description:P25116
Residue:425
BDBM50197614
NameBDBM50197614
Synonyms:CHEMBL3939323 | US10322140, Example 12
TypeSmall organic molecule
Emp. Form.C27H24F2N4O2
Mol. Mass.474.5019
SMILES[H][C@@]12[C@@H](C)OC(=O)[C@@]1(CC(F)(F)[C@@H](C)[C@@H]2\C=C\c1ccc(cn1)-c1ccccc1C#N)c1cc[nH]n1