Reaction Details
TargetCytochrome P450 3A4
LigandBDBM50197651
Substrate/Competitorn/a
Meas. Tech.ChEMBL_1619629 (CHEMBL3861798)
IC50>50000±n/a nM
Citation Woolford, AJDay, PJBénéton, VBerdini, VCoyle, JEDudit, YGrondin, PHuet, PLee, LYManas, ESMcMenamin, RLMurray, CWPage, LWPatel, VKPotvain, FRich, SJSang, YSomers, DOTrottet, LWan, ZZhang, X Fragment-Based Approach to the Development of an Orally Bioavailable Lactam Inhibitor of Lipoprotein-Associated Phospholipase A2 (Lp-PLA J Med Chem59:10738-10749 (2016) 
 
Cytochrome P450 3A4
Name:Cytochrome P450 3A4
Type:Enzyme
Mol. Mass.:57349.57
Organism:Homo sapiens (Human)
Description:n/a
Residue:503
BDBM50197651
NameBDBM50197651
Synonyms:CHEMBL3957888
TypeSmall organic molecule
Emp. Form.C18H23F2NO4S
Mol. Mass.387.441
SMILESCC1(CCS(=O)(=O)CC1)[C@H]1CN(CCOc2ccc(F)c(F)c2)C(=O)C1