Reaction Details
TargetPlatelet-activating factor acetylhydrolase
LigandBDBM50197654
Substrate/Competitorn/a
Meas. Tech.ChEMBL_1619621 (CHEMBL3861790)
IC50 3900±n/a nM
Citation Woolford, AJDay, PJBénéton, VBerdini, VCoyle, JEDudit, YGrondin, PHuet, PLee, LYManas, ESMcMenamin, RLMurray, CWPage, LWPatel, VKPotvain, FRich, SJSang, YSomers, DOTrottet, LWan, ZZhang, X Fragment-Based Approach to the Development of an Orally Bioavailable Lactam Inhibitor of Lipoprotein-Associated Phospholipase A2 (Lp-PLA J Med Chem59:10738-10749 (2016) 
 
Platelet-activating factor acetylhydrolase
Name:Platelet-activating factor acetylhydrolase
Type:PROTEIN
Mol. Mass.:50084.41
Organism:Homo sapiens (Human)
Description:ChEMBL_156212
Residue:441
BDBM50197654
NameBDBM50197654
Synonyms:CHEMBL3930398
TypeSmall organic molecule
Emp. Form.C18H21FN2O4S
Mol. Mass.380.434
SMILESFc1ccc(OCCN2CC(CC2=O)C2CCS(=O)(=O)CC2)cc1C#N