Reaction Details
TargetCytochrome P450 3A4
LigandBDBM50197658
Substrate/Competitorn/a
Meas. Tech.ChEMBL_1619629 (CHEMBL3861798)
IC50>50000±n/a nM
Citation Woolford, AJDay, PJBénéton, VBerdini, VCoyle, JEDudit, YGrondin, PHuet, PLee, LYManas, ESMcMenamin, RLMurray, CWPage, LWPatel, VKPotvain, FRich, SJSang, YSomers, DOTrottet, LWan, ZZhang, X Fragment-Based Approach to the Development of an Orally Bioavailable Lactam Inhibitor of Lipoprotein-Associated Phospholipase A2 (Lp-PLA J Med Chem59:10738-10749 (2016) 
 
Cytochrome P450 3A4
Name:Cytochrome P450 3A4
Type:Enzyme
Mol. Mass.:57349.57
Organism:Homo sapiens (Human)
Description:n/a
Residue:503
BDBM50197658
NameBDBM50197658
Synonyms:CHEMBL3897162
TypeSmall organic molecule
Emp. Form.C20H26FN3O2
Mol. Mass.359.4377
SMILESCN1CCC(C)(CC1)C1CN(CCOc2ccc(F)c(c2)C#N)C(=O)C1