Reaction Details
TargetPlatelet-activating factor acetylhydrolase
LigandBDBM50197681
Substrate/Competitorn/a
Meas. Tech.ChEMBL_1619621 (CHEMBL3861790)
IC50 39000±n/a nM
Citation Woolford, AJDay, PJBénéton, VBerdini, VCoyle, JEDudit, YGrondin, PHuet, PLee, LYManas, ESMcMenamin, RLMurray, CWPage, LWPatel, VKPotvain, FRich, SJSang, YSomers, DOTrottet, LWan, ZZhang, X Fragment-Based Approach to the Development of an Orally Bioavailable Lactam Inhibitor of Lipoprotein-Associated Phospholipase A2 (Lp-PLA J Med Chem59:10738-10749 (2016) 
 
Platelet-activating factor acetylhydrolase
Name:Platelet-activating factor acetylhydrolase
Type:PROTEIN
Mol. Mass.:50084.41
Organism:Homo sapiens (Human)
Description:ChEMBL_156212
Residue:441
BDBM50197681
NameBDBM50197681
Synonyms:CHEMBL3895499
TypeSmall organic molecule
Emp. Form.C13H17FN2O2
Mol. Mass.252.2847
SMILESCC1(C)CN(CCOc2ccc(F)cc2)C(=O)N1