Reaction Details
TargetCarbonic anhydrase 2
LigandBDBM50197811
Substrate/Competitorn/a
Meas. Tech.ChEMBL_1619737 (CHEMBL3861906)
Ki 1.5±n/a nM
Citation Nocentini, AFerraroni, MCarta, FCeruso, MGratteri, PLanzi, CMasini, ESupuran, CT Benzenesulfonamides Incorporating Flexible Triazole Moieties Are Highly Effective Carbonic Anhydrase Inhibitors: Synthesis and Kinetic, Crystallographic, Computational, and Intraocular Pressure Lowering Investigations. J Med Chem59:10692-10704 (2016) 
 
Carbonic anhydrase 2
Name:Carbonic anhydrase 2
Type:Enzyme
Mol. Mass.:29250.71
Organism:Homo sapiens (Human)
Description:P00918
Residue:260
BDBM50197811
NameBDBM50197811
Synonyms:CHEMBL3936646
TypeSmall organic molecule
Emp. Form.C15H14N4O2S2
Mol. Mass.346.427
SMILESNS(=O)(=O)c1ccc(cc1)-n1cc(CSc2ccccc2)nn1