Reaction Details
TargetCarbonic anhydrase 1
LigandBDBM50197816
Substrate/Competitorn/a
Meas. Tech.ChEMBL_1619736 (CHEMBL3861905)
Ki 350±n/a nM
Citation Nocentini, AFerraroni, MCarta, FCeruso, MGratteri, PLanzi, CMasini, ESupuran, CT Benzenesulfonamides Incorporating Flexible Triazole Moieties Are Highly Effective Carbonic Anhydrase Inhibitors: Synthesis and Kinetic, Crystallographic, Computational, and Intraocular Pressure Lowering Investigations. J Med Chem59:10692-10704 (2016) 
 
Carbonic anhydrase 1
Name:Carbonic anhydrase 1
Type:Enzyme
Mol. Mass.:28873.37
Organism:Homo sapiens (Human)
Description:P00915
Residue:261
BDBM50197816
NameBDBM50197816
Synonyms:CHEMBL3918252
TypeSmall organic molecule
Emp. Form.C15H14N4O3S
Mol. Mass.330.362
SMILESNS(=O)(=O)c1ccc(cc1)-n1cc(COc2ccccc2)nn1