Reaction Details
TargetCarbonic anhydrase 1
LigandBDBM50197815
Substrate/Competitorn/a
Meas. Tech.ChEMBL_1619736 (CHEMBL3861905)
Ki 566±n/a nM
Citation Nocentini, AFerraroni, MCarta, FCeruso, MGratteri, PLanzi, CMasini, ESupuran, CT Benzenesulfonamides Incorporating Flexible Triazole Moieties Are Highly Effective Carbonic Anhydrase Inhibitors: Synthesis and Kinetic, Crystallographic, Computational, and Intraocular Pressure Lowering Investigations. J Med Chem59:10692-10704 (2016) 
 
Carbonic anhydrase 1
Name:Carbonic anhydrase 1
Type:Enzyme
Mol. Mass.:28873.37
Organism:Homo sapiens (Human)
Description:P00915
Residue:261
BDBM50197815
NameBDBM50197815
Synonyms:CHEMBL3917661
TypeSmall organic molecule
Emp. Form.C15H14N4O3S
Mol. Mass.330.362
SMILESNS(=O)(=O)c1ccc(OCc2cn(nn2)-c2ccccc2)cc1