Reaction Details
TargetCarbonic anhydrase 9
LigandBDBM50197820
Substrate/Competitorn/a
Meas. Tech.ChEMBL_1619738 (CHEMBL3861907)
Ki 12±n/a nM
Citation Nocentini, AFerraroni, MCarta, FCeruso, MGratteri, PLanzi, CMasini, ESupuran, CT Benzenesulfonamides Incorporating Flexible Triazole Moieties Are Highly Effective Carbonic Anhydrase Inhibitors: Synthesis and Kinetic, Crystallographic, Computational, and Intraocular Pressure Lowering Investigations. J Med Chem59:10692-10704 (2016) 
 
Carbonic anhydrase 9
Name:Carbonic anhydrase 9
Type:Enzyme
Mol. Mass.:49669.03
Organism:Homo sapiens (Human)
Description:Catalytic domain of human cloned isozyme was used in the assay
Residue:459
BDBM50197820
NameBDBM50197820
Synonyms:CHEMBL3933768
TypeSmall organic molecule
Emp. Form.C24H23N9O4S2
Mol. Mass.565.627
SMILESNS(=O)(=O)c1ccc(cc1)-n1cc(CN(Cc2cn(nn2)-c2ccc(cc2)S(N)(=O)=O)c2ccccc2)nn1