Reaction Details
TargetCarbonic anhydrase 12
LigandBDBM50197819
Substrate/Competitorn/a
Meas. Tech.ChEMBL_1619739 (CHEMBL3861908)
Ki 5.4±n/a nM
Citation Nocentini, AFerraroni, MCarta, FCeruso, MGratteri, PLanzi, CMasini, ESupuran, CT Benzenesulfonamides Incorporating Flexible Triazole Moieties Are Highly Effective Carbonic Anhydrase Inhibitors: Synthesis and Kinetic, Crystallographic, Computational, and Intraocular Pressure Lowering Investigations. J Med Chem59:10692-10704 (2016) 
 
Carbonic anhydrase 12
Name:Carbonic anhydrase 12
Type:Enzyme
Mol. Mass.:39456.00
Organism:Homo sapiens (Human)
Description:Catalytic domain of human cloned isozyme was used in the assay
Residue:354
BDBM50197819
NameBDBM50197819
Synonyms:CHEMBL3979541
TypeSmall organic molecule
Emp. Form.C16H16N4O3S
Mol. Mass.344.388
SMILESCc1cccc(OCc2cn(nn2)-c2ccc(cc2)S(N)(=O)=O)c1