Reaction Details
TargetCarbonic anhydrase 12
LigandBDBM50197811
Substrate/Competitorn/a
Meas. Tech.ChEMBL_1619739 (CHEMBL3861908)
Ki 4.9±n/a nM
Citation Nocentini, AFerraroni, MCarta, FCeruso, MGratteri, PLanzi, CMasini, ESupuran, CT Benzenesulfonamides Incorporating Flexible Triazole Moieties Are Highly Effective Carbonic Anhydrase Inhibitors: Synthesis and Kinetic, Crystallographic, Computational, and Intraocular Pressure Lowering Investigations. J Med Chem59:10692-10704 (2016) 
 
Carbonic anhydrase 12
Name:Carbonic anhydrase 12
Type:Enzyme
Mol. Mass.:39456.00
Organism:Homo sapiens (Human)
Description:Catalytic domain of human cloned isozyme was used in the assay
Residue:354
BDBM50197811
NameBDBM50197811
Synonyms:CHEMBL3936646
TypeSmall organic molecule
Emp. Form.C15H14N4O2S2
Mol. Mass.346.427
SMILESNS(=O)(=O)c1ccc(cc1)-n1cc(CSc2ccccc2)nn1