Reaction Details
TargetCarbonic anhydrase 1
LigandBDBM50197821
Substrate/Competitorn/a
Meas. Tech.ChEMBL_1619736 (CHEMBL3861905)
Ki 351±n/a nM
Citation Nocentini, AFerraroni, MCarta, FCeruso, MGratteri, PLanzi, CMasini, ESupuran, CT Benzenesulfonamides Incorporating Flexible Triazole Moieties Are Highly Effective Carbonic Anhydrase Inhibitors: Synthesis and Kinetic, Crystallographic, Computational, and Intraocular Pressure Lowering Investigations. J Med Chem59:10692-10704 (2016) 
 
Carbonic anhydrase 1
Name:Carbonic anhydrase 1
Type:Enzyme
Mol. Mass.:28873.37
Organism:Homo sapiens (Human)
Description:P00915
Residue:261
BDBM50197821
NameBDBM50197821
Synonyms:CHEMBL3909323
TypeSmall organic molecule
Emp. Form.C16H16N4O4S
Mol. Mass.360.388
SMILESCOc1cccc(OCc2cn(nn2)-c2ccc(cc2)S(N)(=O)=O)c1