Reaction Details
TargetCarbonic anhydrase 2
LigandBDBM50197812
Substrate/Competitorn/a
Meas. Tech.ChEMBL_1619737 (CHEMBL3861906)
Ki 16±n/a nM
Citation Nocentini, AFerraroni, MCarta, FCeruso, MGratteri, PLanzi, CMasini, ESupuran, CT Benzenesulfonamides Incorporating Flexible Triazole Moieties Are Highly Effective Carbonic Anhydrase Inhibitors: Synthesis and Kinetic, Crystallographic, Computational, and Intraocular Pressure Lowering Investigations. J Med Chem59:10692-10704 (2016) 
 
Carbonic anhydrase 2
Name:Carbonic anhydrase 2
Type:Enzyme
Mol. Mass.:29250.71
Organism:Homo sapiens (Human)
Description:P00918
Residue:260
BDBM50197812
NameBDBM50197812
Synonyms:CHEMBL3949320
TypeSmall organic molecule
Emp. Form.C16H13F3N4O3S
Mol. Mass.398.36
SMILESNS(=O)(=O)c1ccc(OCc2cn(nn2)-c2ccc(cc2)C(F)(F)F)cc1