Reaction Details
Target17-beta-hydroxysteroid dehydrogenase type 2
LigandBDBM50360227
Substrate/Competitorn/a
Meas. Tech.ChEMBL_1619745 (CHEMBL3861914)
IC50 40±n/a nM
Citation Braun, FBertoletti, NMöller, GAdamski, JSteinmetzer, TSalah, MAbdelsamie, ASvan Koppen, CJHeine, AKlebe, GMarchais-Oberwinkler, S First Structure-Activity Relationship of 17ß-Hydroxysteroid Dehydrogenase Type 14 Nonsteroidal Inhibitors and Crystal Structures in Complex with the Enzyme. J Med Chem59:10719-10737 (2016) 
 
17-beta-hydroxysteroid dehydrogenase type 2
Name:17-beta-hydroxysteroid dehydrogenase type 2
Type:Oxidoreductase; single-pass type II membrane protein
Mol. Mass.:42795.29
Organism:Homo sapiens (Human)
Description:Enzyme was partially purified from human placenta.
Residue:387
BDBM50360227
NameBDBM50360227
Synonyms:CHEMBL1928180
TypeSmall organic molecule
Emp. Form.C20H15FO3
Mol. Mass.322.3297
SMILESCc1cc(ccc1O)-c1ccc(cc1)C(=O)c1ccc(F)c(O)c1