Reaction Details
Target17-beta-hydroxysteroid dehydrogenase type 2
LigandBDBM50360231
Substrate/Competitorn/a
Meas. Tech.ChEMBL_1619745 (CHEMBL3861914)
IC50 260±n/a nM
Citation Braun, FBertoletti, NMöller, GAdamski, JSteinmetzer, TSalah, MAbdelsamie, ASvan Koppen, CJHeine, AKlebe, GMarchais-Oberwinkler, S First Structure-Activity Relationship of 17ß-Hydroxysteroid Dehydrogenase Type 14 Nonsteroidal Inhibitors and Crystal Structures in Complex with the Enzyme. J Med Chem59:10719-10737 (2016) 
 
17-beta-hydroxysteroid dehydrogenase type 2
Name:17-beta-hydroxysteroid dehydrogenase type 2
Type:Oxidoreductase; single-pass type II membrane protein
Mol. Mass.:42795.29
Organism:Homo sapiens (Human)
Description:Enzyme was partially purified from human placenta.
Residue:387
BDBM50360231
NameBDBM50360231
Synonyms:CHEMBL1928185
TypeSmall organic molecule
Emp. Form.C19H15NO3
Mol. Mass.305.3273
SMILESCc1cc(ccc1O)-c1ccc(nc1)C(=O)c1cccc(O)c1