Reaction Details
Target17-beta-hydroxysteroid dehydrogenase 14
LigandBDBM50197836
Substrate/Competitorn/a
Meas. Tech.ChEMBL_1619749 (CHEMBL3861918)
Ki 190±n/a nM
Citation Braun, FBertoletti, NMöller, GAdamski, JSteinmetzer, TSalah, MAbdelsamie, ASvan Koppen, CJHeine, AKlebe, GMarchais-Oberwinkler, S First Structure-Activity Relationship of 17ß-Hydroxysteroid Dehydrogenase Type 14 Nonsteroidal Inhibitors and Crystal Structures in Complex with the Enzyme. J Med Chem59:10719-10737 (2016) 
 
17-beta-hydroxysteroid dehydrogenase 14
Name:17-beta-hydroxysteroid dehydrogenase 14
Type:PROTEIN
Mol. Mass.:28316.15
Organism:Homo sapiens (Human)
Description:ChEMBL_114829
Residue:270
BDBM50197836
NameBDBM50197836
Synonyms:CHEMBL3946020
TypeSmall organic molecule
Emp. Form.C18H10ClF2NO2
Mol. Mass.345.727
SMILESOc1cc(ccc1F)C(=O)c1cccc(n1)-c1ccc(F)c(Cl)c1