Reaction Details
Target17-beta-hydroxysteroid dehydrogenase type 1
LigandBDBM50360234
Substrate/Competitorn/a
Meas. Tech.ChEMBL_1619744 (CHEMBL3861913)
IC50 19650±n/a nM
Citation Braun, FBertoletti, NMöller, GAdamski, JSteinmetzer, TSalah, MAbdelsamie, ASvan Koppen, CJHeine, AKlebe, GMarchais-Oberwinkler, S First Structure-Activity Relationship of 17ß-Hydroxysteroid Dehydrogenase Type 14 Nonsteroidal Inhibitors and Crystal Structures in Complex with the Enzyme. J Med Chem59:10719-10737 (2016) 
 
17-beta-hydroxysteroid dehydrogenase type 1
Name:17-beta-hydroxysteroid dehydrogenase type 1
Type:Enzyme
Mol. Mass.:34945.13
Organism:Homo sapiens (Human)
Description:P14061
Residue:328
BDBM50360234
NameBDBM50360234
Synonyms:CHEMBL1928188
TypeSmall organic molecule
Emp. Form.C19H15NO3
Mol. Mass.305.3273
SMILESCc1cc(ccc1O)-c1cccc(n1)C(=O)c1cccc(O)c1