Reaction Details
Target17-beta-hydroxysteroid dehydrogenase 14
LigandBDBM50197846
Substrate/Competitorn/a
Meas. Tech.ChEMBL_1619749 (CHEMBL3861918)
Ki 47±n/a nM
Citation Braun, FBertoletti, NMöller, GAdamski, JSteinmetzer, TSalah, MAbdelsamie, ASvan Koppen, CJHeine, AKlebe, GMarchais-Oberwinkler, S First Structure-Activity Relationship of 17ß-Hydroxysteroid Dehydrogenase Type 14 Nonsteroidal Inhibitors and Crystal Structures in Complex with the Enzyme. J Med Chem59:10719-10737 (2016) 
 
17-beta-hydroxysteroid dehydrogenase 14
Name:17-beta-hydroxysteroid dehydrogenase 14
Type:PROTEIN
Mol. Mass.:28316.15
Organism:Homo sapiens (Human)
Description:ChEMBL_114829
Residue:270
BDBM50197846
NameBDBM50197846
Synonyms:CHEMBL3954708
TypeSmall organic molecule
Emp. Form.C19H14FNO3
Mol. Mass.323.3178
SMILESCc1ccc(cc1O)-c1cccc(n1)C(=O)c1ccc(F)c(O)c1