Reaction Details
Target17-beta-hydroxysteroid dehydrogenase 14
LigandBDBM50197862
Substrate/Competitorn/a
Meas. Tech.ChEMBL_1619749 (CHEMBL3861918)
Ki 135±n/a nM
Citation Braun, FBertoletti, NMöller, GAdamski, JSteinmetzer, TSalah, MAbdelsamie, ASvan Koppen, CJHeine, AKlebe, GMarchais-Oberwinkler, S First Structure-Activity Relationship of 17ß-Hydroxysteroid Dehydrogenase Type 14 Nonsteroidal Inhibitors and Crystal Structures in Complex with the Enzyme. J Med Chem59:10719-10737 (2016) 
 
17-beta-hydroxysteroid dehydrogenase 14
Name:17-beta-hydroxysteroid dehydrogenase 14
Type:PROTEIN
Mol. Mass.:28316.15
Organism:Homo sapiens (Human)
Description:ChEMBL_114829
Residue:270
BDBM50197862
NameBDBM50197862
Synonyms:CHEMBL3932242
TypeSmall organic molecule
Emp. Form.C18H12FNO3
Mol. Mass.309.2912
SMILESOc1cccc(c1F)-c1cccc(n1)C(=O)c1ccccc1O