Reaction Details
Target17-beta-hydroxysteroid dehydrogenase 14
LigandBDBM50197864
Substrate/Competitorn/a
Meas. Tech.ChEMBL_1619749 (CHEMBL3861918)
Ki 21±n/a nM
Citation Braun, FBertoletti, NMöller, GAdamski, JSteinmetzer, TSalah, MAbdelsamie, ASvan Koppen, CJHeine, AKlebe, GMarchais-Oberwinkler, S First Structure-Activity Relationship of 17ß-Hydroxysteroid Dehydrogenase Type 14 Nonsteroidal Inhibitors and Crystal Structures in Complex with the Enzyme. J Med Chem59:10719-10737 (2016) 
 
17-beta-hydroxysteroid dehydrogenase 14
Name:17-beta-hydroxysteroid dehydrogenase 14
Type:PROTEIN
Mol. Mass.:28316.15
Organism:Homo sapiens (Human)
Description:ChEMBL_114829
Residue:270
BDBM50197864
NameBDBM50197864
Synonyms:CHEMBL3923116
TypeSmall organic molecule
Emp. Form.C19H13FO4
Mol. Mass.324.3025
SMILESOc1cccc(C(=O)c2cccc(c2)-c2cccc(O)c2F)c1O