Reaction Details
TargetAmine oxidase [flavin-containing] A
LigandBDBM50018671
Substrate/Competitorn/a
Meas. Tech.ChEMBL_1620016 (CHEMBL3862299)
IC50 6700±n/a nM
Citation Wu, MYEsteban, GBrogi, SShionoya, MWang, LCampiani, GUnzeta, MInokuchi, TButini, SMarco-Contelles, J Donepezil-like multifunctional agents: Design, synthesis, molecular modeling and biological evaluation. Eur J Med Chem121:864-879 (2016) 
 
Amine oxidase [flavin-containing] A
Name:Amine oxidase [flavin-containing] A
Type:Protein
Mol. Mass.:59689.53
Organism:Homo sapiens (Human)
Description:P21397
Residue:527
BDBM50018671
NameBDBM50018671
Synonyms:CHEMBL3291019
TypeSmall organic molecule
Emp. Form.C29H32N4O
Mol. Mass.452.5906
SMILESOc1ccc(CN(CC#C)C(CCC2CCN(Cc3ccccc3)CC2)C#N)c2cccnc12