Reaction Details
TargetCathepsin S
LigandBDBM50197892
Substrate/Competitorn/a
Meas. Tech.ChEBML_1620103
IC50 23±n/a nM
Citation Plebanek, EChevrier, FRoy, VGarenne, TLecaille, FWarszycki, DBojarski, AJLalmanach, GAgrofoglio, LA Straightforward synthesis of 2,4,6-trisubstituted 1,3,5-triazine compounds targeting cysteine cathepsins K and S. Eur J Med Chem121:12-20 (2016) 
 
Cathepsin S
Name:Cathepsin S
Type:Protein
Mol. Mass.:37507.38
Organism:Homo sapiens (Human)
Description:P25774
Residue:331
BDBM50197892
NameBDBM50197892
Synonyms:CHEMBL3949917
TypeSmall organic molecule
Emp. Form.C18H22N6
Mol. Mass.322.4075
SMILESN#Cc1nc(NCCc2ccccc2)nc(NC2CCCCC2)n1