Reaction Details
TargetEndothelin receptor type B
LigandBDBM50197953
Substrate/Competitorn/a
Meas. Tech.ChEMBL_1620302 (CHEMBL3862585)
IC50 0.100000±n/a nM
Citation Lepri, SGoracci, LValeri, ACruciani, G Metabolism study and biological evaluation of bosentan derivatives. Eur J Med Chem121:658-670 (2016) 
 
Endothelin receptor type B
Name:Endothelin receptor type B
Type:Enzyme Catalytic Domain
Mol. Mass.:49664.00
Organism:Homo sapiens (Human)
Description:ENDOTHELIN B EDNRB HUMAN::P24530
Residue:442
BDBM50197953
NameBDBM50197953
Synonyms:CHEMBL3980643
TypeSmall organic molecule
Emp. Form.C109H160N26O31S5
Mol. Mass.2490.917
SMILESCC[C@H](C)[C@H](NC(=O)[C@@H](NC(=O)[C@H](CC(O)=O)NC(=O)[C@H](CC(C)C)NC(=O)[C@H](Cc1cnc[nH]1)NC(=O)[C@@H]1CSSC[C@H](N)C(=O)N[C@@H](CO)C(=O)N[C@H]2CSSC[C@H](NC(=O)[C@H](CCC(O)=O)NC(=O)[C@H](CCCCN)NC(=O)[C@H](CC(O)=O)NC(=O)[C@H](CCSC)NC(=O)[C@H](CC(C)C)NC(=O)[C@H](CO)NC(=O)[C@H](CO)NC2=O)C(=O)N[C@@H](C(C)C)C(=O)N[C@@H](Cc2ccc(O)cc2)C(=O)N[C@@H](Cc2ccccc2)C(=O)N1)[C@@H](C)CC)C(=O)N[C@@H](Cc1c[nH]c2ccccc12)C(N)=O