Reaction Details
TargetEndothelin receptor type B
LigandBDBM50061101
Substrate/Competitorn/a
Meas. Tech.ChEMBL_1620306 (CHEMBL3862589)
IC50 95±n/a nM
Citation Lepri, SGoracci, LValeri, ACruciani, G Metabolism study and biological evaluation of bosentan derivatives. Eur J Med Chem121:658-670 (2016) 
 
Endothelin receptor type B
Name:Endothelin receptor type B
Type:Enzyme Catalytic Domain
Mol. Mass.:49664.00
Organism:Homo sapiens (Human)
Description:ENDOTHELIN B EDNRB HUMAN::P24530
Residue:442
BDBM50061101
NameBDBM50061101
Synonyms:4-(1,1-Dimethylethyl)-N-(6-(2-hydroxyethoxy)-5-(2-methoxyphenoxy)-(2,2'-bipyrimidin)-4-yl) benzenesulfornamide BOSENTAN p-tert-Butyl-N-(6-(2-hydroxyethoxy)-5-(o-methoxyphenoxy)-2-(2-pyrimidinyl)-4-pyrimidinyl)benzenesulfonamide
TypeSmall organic molecule
Emp. Form.C27H29N5O6S
Mol. Mass.551.614
SMILESCOc1ccccc1Oc1c(NS(=O)(=O)c2ccc(cc2)C(C)(C)C)nc(nc1OCCO)-c1ncccn1