Reaction Details
TargetHeat sensitive channel TRPV3
LigandBDBM50197962
Substrate/Competitorn/a
Meas. Tech.ChEMBL_1620335 (CHEMBL3862618)
IC50 57500±n/a nM
Citation Pollastro, FGolin, SChianese, GPutra, MYSchiano Moriello, ADe Petrocellis, LGarcía, VMunoz, ETaglialatela-Scafati, OAppendino, G Neuroactive and Anti-inflammatory Frankincense Cembranes: A Structure-Activity Study. J Nat Prod79:1762-8 (2016) 
 
Heat sensitive channel TRPV3
Name:Heat sensitive channel TRPV3
Synonyms:Heat sensitive channel TRPV3
Type:PROTEIN
Mol. Mass.:90273.53
Organism:Rattus norvegicus
Description:ChEMBL_116972
Residue:791
BDBM50197962
NameBDBM50197962
Synonyms:CHEMBL3894504
TypeSmall organic molecule
Emp. Form.C20H30O2
Mol. Mass.302.451
SMILES[H][C@@]12CC\C(C)=C\[C@]3([H])OCC(C)=C3CC\C(C)=C\CC[C@]1(C)O2