Reaction Details
TargetHeat sensitive channel TRPV3
LigandBDBM50197966
Substrate/Competitorn/a
Meas. Tech.ChEMBL_1620334 (CHEMBL3862617)
EC50 4400±n/a nM
Citation Pollastro, FGolin, SChianese, GPutra, MYSchiano Moriello, ADe Petrocellis, LGarcía, VMunoz, ETaglialatela-Scafati, OAppendino, G Neuroactive and Anti-inflammatory Frankincense Cembranes: A Structure-Activity Study. J Nat Prod79:1762-8 (2016) 
 
Heat sensitive channel TRPV3
Name:Heat sensitive channel TRPV3
Synonyms:Heat sensitive channel TRPV3
Type:PROTEIN
Mol. Mass.:90273.53
Organism:Rattus norvegicus
Description:ChEMBL_116972
Residue:791
BDBM50197966
NameBDBM50197966
Synonyms:CHEMBL3959869
TypeSmall organic molecule
Emp. Form.C27H38O3
Mol. Mass.410.5888
SMILESCC(C)[C@@]12CC[C@@](C)(O1)[C@H](CC\C(C)=C\CC\C(C)=C\C2)OC(=O)c1ccccc1