Reaction Details
TargetHeat sensitive channel TRPV3
LigandBDBM50197964
Substrate/Competitorn/a
Meas. Tech.ChEMBL_1620335 (CHEMBL3862618)
IC50 12300±n/a nM
Citation Pollastro, FGolin, SChianese, GPutra, MYSchiano Moriello, ADe Petrocellis, LGarcía, VMunoz, ETaglialatela-Scafati, OAppendino, G Neuroactive and Anti-inflammatory Frankincense Cembranes: A Structure-Activity Study. J Nat Prod79:1762-8 (2016) 
 
Heat sensitive channel TRPV3
Name:Heat sensitive channel TRPV3
Synonyms:Heat sensitive channel TRPV3
Type:PROTEIN
Mol. Mass.:90273.53
Organism:Rattus norvegicus
Description:ChEMBL_116972
Residue:791
BDBM50197964
NameBDBM50197964
Synonyms:CHEMBL3922508
TypeSmall organic molecule
Emp. Form.C20H34O2
Mol. Mass.306.4828
SMILESCC(C)[C@@]12CC[C@@](C)(O1)[C@H](O)CC\C(C)=C\CC\C(C)=C\C2