Reaction Details
TargetAurora kinase A
LigandBDBM50198044
Substrate/Competitorn/a
Meas. Tech.ChEMBL_1620440 (CHEMBL3862723)
IC50 25±n/a nM
Citation Kilchmann, FMarcaida, MJKotak, SSchick, TBoss, SDAwale, MGönczy, PReymond, JL Discovery of a Selective Aurora A Kinase Inhibitor by Virtual Screening. J Med Chem59:7188-211 (2016) 
 
Aurora kinase A
Name:Aurora kinase A
Type:Serine/threonine-protein kinase
Mol. Mass.:45830.98
Organism:Homo sapiens (Human)
Description:O14965
Residue:403
BDBM50198044
NameBDBM50198044
Synonyms:CHEMBL3903187
TypeSmall organic molecule
Emp. Form.C25H22N8OS
Mol. Mass.482.56
SMILESCCc1ccc(cc1)\N=C1/S\C(=C/c2ccnc(Nc3ccc(cc3)-c3nnn[nH]3)c2)C(=O)N1C