Reaction Details
TargetAurora kinase A
LigandBDBM50198046
Substrate/Competitorn/a
Meas. Tech.ChEMBL_1620440 (CHEMBL3862723)
IC50 1600±n/a nM
Citation Kilchmann, FMarcaida, MJKotak, SSchick, TBoss, SDAwale, MGönczy, PReymond, JL Discovery of a Selective Aurora A Kinase Inhibitor by Virtual Screening. J Med Chem59:7188-211 (2016) 
 
Aurora kinase A
Name:Aurora kinase A
Type:Serine/threonine-protein kinase
Mol. Mass.:45830.98
Organism:Homo sapiens (Human)
Description:O14965
Residue:403
BDBM50198046
NameBDBM50198046
Synonyms:CHEMBL3911508
TypeSmall organic molecule
Emp. Form.C20H21N3OS
Mol. Mass.351.465
SMILESCN1\C(S\C(=C/c2ccncc2)C1=O)=N\c1ccc(cc1)C(C)(C)C