Reaction Details
TargetAurora kinase A
LigandBDBM50198070
Substrate/Competitorn/a
Meas. Tech.ChEMBL_1620440 (CHEMBL3862723)
IC50>70000±n/a nM
Citation Kilchmann, FMarcaida, MJKotak, SSchick, TBoss, SDAwale, MGönczy, PReymond, JL Discovery of a Selective Aurora A Kinase Inhibitor by Virtual Screening. J Med Chem59:7188-211 (2016) 
 
Aurora kinase A
Name:Aurora kinase A
Type:Serine/threonine-protein kinase
Mol. Mass.:45830.98
Organism:Homo sapiens (Human)
Description:O14965
Residue:403
BDBM50198070
NameBDBM50198070
Synonyms:CHEMBL3893267
TypeSmall organic molecule
Emp. Form.C15H9F3N4O
Mol. Mass.318.2534
SMILESFC(F)(F)c1ccc2[nH]c(nc2c1)-n1c2ccccc2[nH]c1=O