Reaction Details
TargetAurora kinase A
LigandBDBM50198071
Substrate/Competitorn/a
Meas. Tech.ChEMBL_1620440 (CHEMBL3862723)
IC50 15000±n/a nM
Citation Kilchmann, FMarcaida, MJKotak, SSchick, TBoss, SDAwale, MGönczy, PReymond, JL Discovery of a Selective Aurora A Kinase Inhibitor by Virtual Screening. J Med Chem59:7188-211 (2016) 
 
Aurora kinase A
Name:Aurora kinase A
Type:Serine/threonine-protein kinase
Mol. Mass.:45830.98
Organism:Homo sapiens (Human)
Description:O14965
Residue:403
BDBM50198071
NameBDBM50198071
Synonyms:CHEMBL3902875
TypeSmall organic molecule
Emp. Form.C14H10N4O2
Mol. Mass.266.2548
SMILESOc1cccc2[nH]c(=O)n(-c3nc4ccccc4[nH]3)c12