Reaction Details
TargetAurora kinase A
LigandBDBM50198027
Substrate/Competitorn/a
Meas. Tech.ChEMBL_1620459 (CHEMBL3862742)
IC50 760±n/a nM
Citation Kilchmann, FMarcaida, MJKotak, SSchick, TBoss, SDAwale, MGönczy, PReymond, JL Discovery of a Selective Aurora A Kinase Inhibitor by Virtual Screening. J Med Chem59:7188-211 (2016) 
 
Aurora kinase A
Name:Aurora kinase A
Type:Serine/threonine-protein kinase
Mol. Mass.:45830.98
Organism:Homo sapiens (Human)
Description:O14965
Residue:403
BDBM50198027
NameBDBM50198027
Synonyms:CHEMBL3921246
TypeSmall organic molecule
Emp. Form.C24H21N5O3S
Mol. Mass.459.52
SMILESCCc1ccc(cc1)\N=C1/S\C(=C/c2ccnc(Nc3ccc(cn3)C(O)=O)c2)C(=O)N1C