Reaction Details
TargetAurora kinase B
LigandBDBM50175305
Substrate/Competitorn/a
Meas. Tech.ChEMBL_1620461 (CHEMBL3862744)
IC50>10.0±n/a nM
Citation Kilchmann, FMarcaida, MJKotak, SSchick, TBoss, SDAwale, MGönczy, PReymond, JL Discovery of a Selective Aurora A Kinase Inhibitor by Virtual Screening. J Med Chem59:7188-211 (2016) 
 
Aurora kinase B
Name:Aurora kinase B
Type:Protein
Mol. Mass.:39327.72
Organism:Homo sapiens (Human)
Description:Q96GD4
Residue:344
BDBM50175305
NameBDBM50175305
Synonyms:CHEMBL3600873
TypeSmall organic molecule
Emp. Form.C22H21ClFN3O3S
Mol. Mass.461.937
SMILESOC(=O)[C@@]1(Cc2cccc(Nc3nccs3)n2)CC[C@@H](CC1)Oc1cccc(Cl)c1F