Reaction Details
TargetMacrophage colony-stimulating factor 1 receptor
LigandBDBM50198027
Substrate/Competitorn/a
Meas. Tech.ChEMBL_1620451 (CHEMBL3862734)
Kd 120±n/a nM
Citation Kilchmann, FMarcaida, MJKotak, SSchick, TBoss, SDAwale, MGönczy, PReymond, JL Discovery of a Selective Aurora A Kinase Inhibitor by Virtual Screening. J Med Chem59:7188-211 (2016) 
 
Macrophage colony-stimulating factor 1 receptor
Name:Macrophage colony-stimulating factor 1 receptor
Type:Protein
Mol. Mass.:107979.48
Organism:Homo sapiens (Human)
Description:P07333
Residue:972
BDBM50198027
NameBDBM50198027
Synonyms:CHEMBL3921246
TypeSmall organic molecule
Emp. Form.C24H21N5O3S
Mol. Mass.459.52
SMILESCCc1ccc(cc1)\N=C1/S\C(=C/c2ccnc(Nc3ccc(cn3)C(O)=O)c2)C(=O)N1C